Ana içeriğe geç
Yardım

Güncel sürümün sahibi: FnX ,

Başlık:

Understanding the diagnostics log.

Metin:

I would greatly appreciate it if anybody could help me to pinpoint these errors (piece of hardware, sensors location, etc. log below).
* Temp (TC0D) - CPU 0 Die Temp (test #1) - Sensor Reads Within Operating Range - Check to ensure that sensor reads within operating range. ERROR -- 1 [Unable to read sensor] -- (1.00) TEST FAILED
* Temp (Th1H) - Heat Pipe 2 Heatsink (test #1) - Sensor Reads Within Operating Range - Check to ensure that sensor reads within operating range. ERROR -- 1 [Unable to read sensor] -- (1.00) TEST FAILED
* Temp (Ts0P) - Skin 0 Proximity (test #1) - Sensor Reads Within Operating Range - Check to ensure that sensor reads withing operating range. ERROR -- 1 [Unable to read sensor] -- (1.00) TEST FAILED
Thanks!
+
+== Update ==
+
+Left thermal sensor was broken, causing TC0D & Th1H. Ts0P (Skin 0 Proximity) error still remains, it isn't one of the 3 thermal sensors. Any ideas?
+
+FnX

Cihaz:

MacBook Pro 15" Core 2 Duo Models A1226 and A1260

Durum:

open

Orijinal gönderinin sahibi: FnX ,

Başlık:

Understanding the diagnostics log.

Metin:

I would greatly appreciate it if anybody could help me to pinpoint these errors (piece of hardware, sensors location, etc. log below).

* Temp (TC0D) - CPU 0 Die Temp (test #1) - Sensor Reads Within Operating Range - Check to ensure that sensor reads within operating range. ERROR -- 1 [Unable to read sensor] -- (1.00) TEST FAILED
* Temp (Th1H) - Heat Pipe 2 Heatsink (test #1) - Sensor Reads Within Operating Range - Check to ensure that sensor reads within operating range. ERROR -- 1 [Unable to read sensor] -- (1.00) TEST FAILED
* Temp (Ts0P) - Skin 0 Proximity (test #1) - Sensor Reads Within Operating Range - Check to ensure that sensor reads withing operating range. ERROR -- 1 [Unable to read sensor] -- (1.00) TEST FAILED

Thanks!

Cihaz:

MacBook Pro 15" Core 2 Duo Models A1226 and A1260

Durum:

open